testify
type: ObjectProperty
inverse of: isTestifiedBy
domain: Acknowledgement Statement
range: Contribution
comment: An Acknowledgement Statement testifies a [Contribution](../entities/Contribution.md).

hasActor
type: ObjectProperty
inverse of: isActorIn
domain: Activity
range: Agent
comment: An Activity typically has the actor: an instance of [Agent](../entities/Agent.md). For some subclasses of Activity, the Agent may not be known or disclosed (e.g. for blind reviews). Also if the actor uses a pseudonym, their identity (and sometimes event the type) are unknown, in which case just a display name is available.

hasAffiliationStatement
type: ObjectProperty
inverse of: isUsedIn
domain: Activity
range: Affiliation Statement
comment: An Activity can have any number of [Affiliation Statements](../entities/Affiliation_Statement.md).

isCoveredBy
type: ObjectProperty
inverse of: covers
domain: Activity
range: Funding
comment: An Activity can be covered by any number of [Fundings](../entities/Funding.md).

isEvidencedBy
type: ObjectProperty
inverse of: proves
domain: Activity
range: Document
comment: An Activity can be evidenced by any number of [Documents](../entities/Document.md).

hasInstitution
type: ObjectProperty
inverse of: isTheInstitutionIn
domain: Affiliation Statement
range: Organisation Unit
comment: An Affiliation Statement has institution, an instance of [Organisation Units](../entities/Organisation_Unit.md).

hasOrganisationUnit
type: ObjectProperty
inverse of: isTheOrganisationUnitIn
domain: Affiliation Statement
range: Organisation Unit
comment: An Affiliation Statement can optionally have an organisation unit, an instance of [Organisation Unit](../entities/Organisation_Unit.md).

hasPerson
type: ObjectProperty
inverse of: isThePersonIn
domain: Affiliation Statement
range: Person
comment: An Affiliation Statement typically has the person, an instance of [Person](../entities/Person.md).

isTheResultOf
type: ObjectProperty
inverse of: isTheFoundationFor
domain: Affiliation Statement
range: Involvement
comment: An Affiliation Statement might be a result of an Agent [Involvement](../entities/Involvement.md).

isUsedIn
type: ObjectProperty
domain: Affiliation Statement
range: Activity
comment: An Affiliation Statement can be used in any number of [Activities](../entities/Activity.md).

awardsPrize
type: ObjectProperty
domain: Agent
range: Event
comment: An Agent can award any number of [Prize Awards](../entities/Prize_Award.md).

hasIdentifier
type: ObjectProperty
inverse of: isAssignedTo
domain: Agent
range: Agent Identifier
comment: An Agent can be assigned any number of [Agent Identifiers](../entities/Agent_Identifier.md).

isActorIn
type: ObjectProperty
domain: Agent
range: Activity
comment: An Agent can be the actor in any number of [Activities](../entities/Activity.md).

isAddresseeOf
type: ObjectProperty
inverse of: hasAddressee
domain: Agent
range: Resource Request
comment: An Agent can be the addressee of any number of [Resource Request](../entities/Resource_Request.md).

isAgentIn1
type: ObjectProperty
inverse of: byAgent
domain: Agent
range: Expertise and Skills Possession
comment: An Agent can be the agent in any number of [Expertise and Skills Possessions](../entities/Expertise_and_Skills_Possession.md).

isAgentIn2
type: ObjectProperty
inverse of: byAgent
domain: Agent
range: Expertise and Time and Effort
comment: An Agent can be the agent in any number of [Expertise and Time and Effort](../entities/Expertise_and_Time_and_Effort.md) instances.

isRecipientOf
type: ObjectProperty
inverse of: hasRecipient
domain: Agent
range: Prize Award
comment: An Agent can be the recipient of any number of [Prize Awards](../entities/Prize_Award.md).

isRequesterIn
type: ObjectProperty
inverse of: hasRequester
domain: Agent
range: Resource Request
comment: An Agent can be the requester in any number of [Applications](../entities/Resource_Request.md).

made
type: ObjectProperty
inverse of: madeBy
domain: Agent
range: Decision
comment: An Agent can make a [Decision](../entities/Decision.md) on Resource Request based or not on Evaluation Outcomes.

solicits
type: ObjectProperty
inverse of: isSolicitedBy
domain: Agent
range: Resource Offer
comment: An Agent can solicit any number of [Resource Offers](../entities/Resource_Offer.md).

isAssignedTo
type: ObjectProperty
domain: Agent Identifier
range: Agent
comment: An Agent Identifier is assigned to an [Agent](../entities/Agent.md).

inResponseTo
type: ObjectProperty
inverse of: hasApplication
domain: Application
range: Call for Applications
comment: An Application can optionally reference the [Call for Applications](../entities/Call_for_Applications.md) it responds to.

hasApplication
type: ObjectProperty
domain: Call for Applications
range: Application
comment: A Call for Applications can reference the [Applications](../entities/Application.md) that make a reference to it.

appliesTo
type: ObjectProperty
inverse of: hasCondition
domain: Condition
range: Resource Offer
comment: A Condition applies to a [Resource Offer](../entities/Resource_Offer.md).

hasContributionStatement
type: ObjectProperty
inverse of: references
domain: Contribution
range: Contribution Statement
comment: A Contribution can have any number of [Contribution Statements](../entities/Contribution_Statement.md).

isTestifiedBy
type: ObjectProperty
domain: Contribution
range: Acknowledgement Statement
comment: A Contribution can be testified by any number of [Acknowledgement Statements](../entities/Acknowledgement_Statement.md).

isDetailedIn
type: ObjectProperty
inverse of: details
domain: Contribution Statement
range: Resource Usage Statement
comment: A Contribution Statement can be detailed in any number of [Resource Usage Statements](../entities/Resource_Usage_Statement.md).

provides
type: ObjectProperty
inverse of: isProvidedBy
domain: Contribution Statement
range: Resource
comment: A Contribution Statement can optionally provide any number of [Resources](../entities/Resource.md). These resources can be funding, expertise, equipment, time or space.

references
type: ObjectProperty
domain: Contribution Statement
range: Contribution
comment: A Contribution Statement references the [Contribution](../entities/Contribution.md) to which it relates.

hasTarget
type: ObjectProperty
inverse of: hasContribution
domain: Contribution to Document
range: Document
comment: A Contribution to Document always references the target [Document](../entities/Document.md).

hasTarget
type: ObjectProperty
inverse of: hasContribution
domain: Contribution to Evaluation Outcome
range: Decision
comment: A Contribution to Evaluation Outcome always references the target [Evaluation Outcome](../entities/Evaluation_Outcome.md).

hasTarget
type: ObjectProperty
inverse of: hasContribution
domain: Contribution to Event
range: Event
comment: A Contribution to Event always references the target [Event](../entities/Event.md).

hasTarget
type: ObjectProperty
inverse of: hasContribution
domain: Contribution to Infrastructure
range: Infrastructure
comment: A Contribution to Infrastructure always references the [Infrastructure](../entities/Infrastructure.md) that benefits from it.

hasTarget
type: ObjectProperty
inverse of: hasContribution
domain: Contribution to Prize
range: Prize
comment: A Contribution to Prize always has the target [Prize](../entities/Prize.md).

hasTarget
type: ObjectProperty
inverse of: hasContribution
domain: Contribution to Prize Award
range: Prize Award
comment: A Contribution to Prize Award always has the target [Prize Award](../entities/Prize_Award.md).

hasTarget
type: ObjectProperty
inverse of: hasContribution
domain: Contribution to Project
range: Project
comment: A Contribution to Project always references the target [Project](../entities/Project.md).

basedOn
type: ObjectProperty
inverse of: providesBasisFor
domain: Decision
range: Decision
comment: A Decision can be based on any number of [Evaluation Outcomes](../entities/Evaluation_Outcome.md).

isADecisionOn
type: ObjectProperty
inverse of: hasDecision
domain: Decision
range: Resource Request
comment: A Resource Request can have a [Decision](../entities/Decision.md) about accepting or refusing request made by addressee.

isExpressedIn
type: ObjectProperty
inverse of: presentsDecision
domain: Decision
range: Document
comment: A Decision can be expressed in a [Document](../entities/Document.md).

madeBy
type: ObjectProperty
domain: Decision
range: Agent
comment: A Decision about accepting or refusing request can be made by any number of [Agents](../entities/Agent.md).

awardedBy
type: ObjectProperty
inverse of: awardedForADocument
domain: Document
range: Prize Award
comment: A Document can be awarded by a [Prize Award](../entities/Prize_Award.md).

describesResourceOffer
type: ObjectProperty
inverse of: isDescribedBy
domain: Document
range: Resource Offer
comment: A Document can provide description of a [Resource Offer](../entities/Resource_Offer.md).

describesResourceRequest
type: ObjectProperty
inverse of: isDescribedBy
domain: Document
range: Resource Request
comment: A Document can provide description of a [Resource Request](../entities/Resource_Request.md).

hasContribution
type: ObjectProperty
domain: Document
range: Contribution to Document
comment: A Document any number of [contributions](../entities/Contribution_to_Document.md) that helped it arise.

hasPart
type: ObjectProperty
inverse of: isPartOf
domain: Document
range: Document
comment: A Document can have any number of [Documents](../entities/Document.md) as parts. [Contents Location](../datatypes/Contents_Location.md) can be attached to such an association.

isDescriptionOf
type: ObjectProperty
inverse of: hasDescription
domain: Document
range: Resource
comment: A Document can be a description of a [Resource](../entities/Resource.md) or Resources.

isMetadataOf
type: ObjectProperty
inverse of: hasMetadata
domain: Document
range: Resource
comment: A Document can be metadata of a [Resource](../entities/Resource.md) or Resources.

isPartOf
type: ObjectProperty
domain: Document
range: Document
comment: A Document can be part of any number of other [Documents](../entities/Document.md). [Contents Location](../datatypes/Contents_Location.md) can be attached to such an association.

presentsDecision
type: ObjectProperty
domain: Document
range: Decision
comment: A Document can present a [Decision](../entities/Decision.md).

proves
type: ObjectProperty
domain: Document
range: Activity
comment: A Document can provide evidence of any number of [Activities](../entities/Activity.md).

providesEvidenceOf
type: ObjectProperty
inverse of: isEvidencedBy
domain: Document
range: Expertise and Skills Possession
comment: A Document can provide evidence of any number of [Expertise and Skills Possessions](../entities/Expertise_and_Skills_Possession.md).

publishedAs
type: ObjectProperty
inverse of: of
domain: Document
range: Document Publication
comment: A Document can be published as [Document Publication](../entities/Document_Publication.md), once or even multiple times.

in
type: ObjectProperty
inverse of: contains
domain: Document Publication
range: Publication Channel
comment: A Document Publication can be published in any number of [Publication Channels](../entities/Publication_Channel.md). [Contents Location](../datatypes/Contents_Location.md) can be attached to such an association.

of
type: ObjectProperty
domain: Document Publication
range: Document
comment: A Document Publication references the published [Document](../entities/Document.md).

hasContribution
type: ObjectProperty
domain: Decision
range: Contribution to Evaluation Outcome
comment: An Evaluation Outcome can have any number of [contributions](../entities/Contribution_to_Evaluation_Outcome.md) that helped it arise.

isAnEvaluationOutcomeOf
type: ObjectProperty
inverse of: hasEvaluationOutcome
domain: Decision
range: Resource Request
comment: An Evaluation outcome might be a result of the [Resource Request](../entities/Resource_Request.md) evaluation process.

providesBasisFor
type: ObjectProperty
domain: Decision
range: Decision
comment: Conclusions from evaluation process can be a basis for final [Decision](../entities/Decision.md).

awardedBy
type: ObjectProperty
inverse of: awardedForAnEvent
domain: Event
range: Prize Award
comment: An Event can be awarded by a [Prize Award](../entities/Prize_Award.md).

belongsToSeries
type: ObjectProperty
inverse of: hasInstances
domain: Event
range: Event_Series
comment: An Event can be an instance of [Event Series](../entities/Event_Series.md).

collocatedWith
type: ObjectProperty
domain: Event
range: Event
comment: An Event can be collocated with the another [Events](../entities/Event.md).

hasContribution
type: ObjectProperty
domain: Event
range: Contribution to Event
comment: An Event can have any number of [contributions](../entities/Contribution_to_Event.md) that helped it take place or arise.

isAssignedTo
type: ObjectProperty
inverse of: hasIdentifier
domain: Event Identifier
range: Event_Series
comment: An Event Identifier can be assigned to an [Event Series](../entities/Event_Series.md).

hasIdentifier
type: ObjectProperty
domain: Event_Series
range: Event Identifier
comment: An Event Series can have any number of [Event Identifiers](../entities/Event_Identifier.md).

hasInstances
type: ObjectProperty
domain: Event_Series
range: Event
comment: An Event Series has list of [Event](../entities/Event.md) instances which have been organized.

isPossessedThrough
type: ObjectProperty
inverse of: possesses
domain: Expertise And Skills
range: Expertise and Skills Possession
comment: A Expertise and Skills can be possessed in any number of [Expertise and Skills Possessions](../entities/Expertise_and_Skills_Possession.md).

isUsedAsAResource
type: ObjectProperty
inverse of: usesExpertiseAndSkills
domain: Expertise And Skills
range: Expertise and Time and Effort
comment: A Expertise and Skills can be used as a resource in any number of [Expertise and Time and Effort](../entities/Expertise_and_Time_and_Effort.md).

byAgent
type: ObjectProperty
domain: Expertise and Skills Possession
range: Agent
comment: An Expertise and Skills Possession references the [Agent](../entities/Agent.md) who posesses the [Expertise and Skills](../entities/Expertise_and_Skills.md).

isEvidencedBy
type: ObjectProperty
domain: Expertise and Skills Possession
range: Document
comment: An Expertise and Skills Possession can be evidenced by any number of [Documents](../entities/Document.md).

possesses
type: ObjectProperty
domain: Expertise and Skills Possession
range: Expertise And Skills
comment: An Expertise and Skills Possession references the [Expertise and Skills](../entities/Expertise_and_Skills.md) that the Agent possesses.

byAgent
type: ObjectProperty
domain: Expertise and Time and Effort
range: Agent
comment: An Expertise and Time and Effort references the [Agent](../entities/Agent.md) whose expertise, time and effort it would be.

usesExpertiseAndSkills
type: ObjectProperty
domain: Expertise and Time and Effort
range: Expertise And Skills
comment: An Expertise and Time and Effort references any number of [Expertises and Skills](../entities/Expertise_and_Skills.md) belonging to the Agent who is providing its expertise and time.

covers
type: ObjectProperty
inverse of: fundedBy
domain: Funding
range: Project
comment: A Funding can cover any number of [Projects](../entities/Project.md) that help it happen.

hasPart
type: ObjectProperty
inverse of: isPartOf
domain: Group
range: Group
comment: A Group can have any number of parts, instances of [Group](../entities/Group.md).

isPartOf
type: ObjectProperty
domain: Group
range: Group
comment: A Group can be part of any number of other [Groups](../entities/Group.md).

hasInvolvement
type: ObjectProperty
inverse of: involvesActorIn
domain: Group or Organisation Unit
range: Involvement
comment: A Group or Organisation Unit can have any number of [Involvements](../entities/Involvement.md), which involve [Agents](../entities/Agent.md) in it.

hasContribution
type: ObjectProperty
domain: Infrastructure
range: Contribution to Infrastructure
comment: An Infrastructure can have any number of [contributions](../entities/Contribution_to_Infrastructure.md) that helped it arise, keep or develop.

hasPart
type: ObjectProperty
inverse of: isPartOf
domain: Involvement
range: Involvement
comment: An Involvement can have any number of part [Involvements](../entities/Involvement.md).

involvesActorIn
type: ObjectProperty
domain: Involvement
range: Group or Organisation Unit
comment: A Involvement specifies that the *actor* Agent is involved in a [Group or Organisation Units](../entities/Group_or_Organisation_Unit.md).

isPartOf
type: ObjectProperty
domain: Involvement
range: Involvement
comment: An Involvement can be part of any number of other [Involvements](../entities/Involvement.md).

isTheFoundationFor
type: ObjectProperty
domain: Involvement
range: Affiliation Statement
comment: An Involvement can be foundation for an [Affiliation Statement](../entities/Affiliation_Statement.md).

hasPart
type: ObjectProperty
inverse of: isPartOf
domain: Organisation Unit
range: Organisation Unit
comment: An Organisation Unit can have any number of parts, instances of [Organisation Unit](../entities/Organisation_Unit.md).

isPartOf
type: ObjectProperty
domain: Organisation Unit
range: Organisation Unit
comment: An Organisation Unit can be part of any number of other [Organisation Units](../entities/Organisation_Unit.md).

isTheInstitutionIn
type: ObjectProperty
domain: Organisation Unit
range: Affiliation Statement
comment: An Organisation Unit can be the institution in any number of [Affiliation Statements](../entities/Affiliation_Statement.md).

isTheOrganisationUnitIn
type: ObjectProperty
domain: Organisation Unit
range: Affiliation Statement
comment: A Organisation Unit can is the organisation unit in any number of [Affiliation Statements](../entities/Affiliation_Statement.md).

isThePersonIn
type: ObjectProperty
domain: Person
range: Affiliation Statement
comment: A Person can be the person in any number of [Affiliation Statements](../entities/Affiliation_Statement.md).

hasContribution
type: ObjectProperty
domain: Prize
range: Contribution to Prize
comment: A Prize can have any number of [contributions](../entities/Contribution_to_Prize.md) that help it arise or continue.

isAwardedAs
type: ObjectProperty
inverse of: awards
domain: Prize
range: Prize Award
comment: A Prize can be awarded through any number of [Prize Awards](../entities/Prize_Award.md).

awardedByWhom
type: ObjectProperty
domain: Prize Award
range: Event
comment: A Prize can be awarded by any number of [Agents](../entities/Agent.md).

awardedForADocument
type: ObjectProperty
domain: Prize Award
range: Document
comment: A Prize can be awarded for a [Document](../entities/Document.md).

awardedForAProject
type: ObjectProperty
inverse of: awardedBy
domain: Prize Award
range: Project
comment: A Prize can be awarded for a [Project](../entities/Project.md).

awardedForAnEvent
type: ObjectProperty
domain: Prize Award
range: Event
comment: A Prize can be awarded for an [Event](../entities/Event.md).

awards
type: ObjectProperty
domain: Prize Award
range: Prize
comment: A Prize Award awards a specific [Prize](../entities/Prize.md).

hasContribution
type: ObjectProperty
domain: Prize Award
range: Contribution to Prize Award
comment: A Prize Award can have any number of [contributions](../entities/Contribution_to_Prize_Award.md) that help its organization.

hasRecipient
type: ObjectProperty
domain: Prize Award
range: Agent
comment: A Prize Award can have any number of recipients, instances of [Agent](../entities/Agent.md).

awardedBy
type: ObjectProperty
domain: Project
range: Prize Award
comment: A Project can be awarded by a [Prize Award](../entities/Prize_Award.md).

fundedBy
type: ObjectProperty
domain: Project
range: Funding
comment: A Project can have any number of [Fundings](../entities/Funding.md) that help it happen.

hasContribution
type: ObjectProperty
domain: Project
range: Contribution to Project
comment: A Project can have any number of [contributions](../entities/Contribution_to_Project.md) that help it happen.

hasPart
type: ObjectProperty
inverse of: isPartOf
domain: Project
range: Project
comment: A Project Unit can have any number of parts, instances of [Project](../entities/Project.md).

isPartOf
type: ObjectProperty
domain: Project
range: Project
comment: A Project Unit (sub-project/work package/task) can be part of the other [Project unit](../entities/Project.md).

contains
type: ObjectProperty
domain: Publication Channel
range: Document Publication
comment: A Publication Channel contains any number of [Document Publications](../entities/Document_Publication.md). [Contents Location](../datatypes/Contents_Location.md) can be attached to such an association.

hasDescription
type: ObjectProperty
domain: Resource
range: Document
comment: A Resource can have any number of [Documents](../entities/Document.md) as descriptions. Note that formalized metadata descriptions should rather use the specific relationship.

hasIdentifier
type: ObjectProperty
inverse of: isAssignedTo
domain: Resource
range: Resource Identifier
comment: A Resource can have any number of [identifiers](../entities/Resource_Identifier.md).

hasMetadata
type: ObjectProperty
domain: Resource
range: Document
comment: A Resource can have any number of [Documents](../entities/Document.md) as metadata descriptions.

hasPart
type: ObjectProperty
inverse of: isPartOf
domain: Resource
range: Resource
comment: A Resource can have any number of other [Resources](../entities/Resource.md) as parts.

isNewVersionOf
type: ObjectProperty
inverse of: isPreviousVersionOf
domain: Resource
range: Resource
comment: A Resource can be a new version of another [Resource](../entities/Resource.md) or Resources.

isOfferedIn
type: ObjectProperty
inverse of: offers
domain: Resource
range: Resource Offer
comment: A Resource can be offered in any number of [Resource Offers](../entities/Resource_Offer.md).

isPartOf
type: ObjectProperty
domain: Resource
range: Resource
comment: A Resource can be part of any number of other [Resources](../entities/Resource.md).

isPreviousVersionOf
type: ObjectProperty
domain: Resource
range: Resource
comment: A Resource can be a previous version of another [Resource](../entities/Resource.md) or Resources.

isProvidedBy
type: ObjectProperty
domain: Resource
range: Contribution Statement
comment: A Resource can be provided in any number of [Contribution Statements](../entities/Contribution_Statement.md).

isRequestedIn
type: ObjectProperty
inverse of: requests
domain: Resource
range: Resource Request
comment: A Resource can be requested in any number of [Resource Requests](../entities/Resource_Request.md).

isUsedIn
type: ObjectProperty
inverse of: uses
domain: Resource
range: Resource Usage Statement
comment: When a Resource is used, the usage can be detailed in [Resource Usage Statements](../entities/Resource_Usage_Statement.md). For instance, a funding, a dataset or a piece of equipment can be used in producing a journal article.

isAssignedTo
type: ObjectProperty
domain: Resource Identifier
range: Resource
comment: A Resource Identifier can be assigned to a [Resource](../entities/Resource.md).

hasCondition
type: ObjectProperty
domain: Resource Offer
range: Condition
comment: A Resource Offer can have any number of [Conditions](../entities/Condition.md) that must be satisfied for the Resource Offer to be applicable.

isDescribedBy
type: ObjectProperty
domain: Resource Offer
range: Document
comment: A Resource Offer can be described by any number of [Documents](../entities/Document.md).

isSolicitedBy
type: ObjectProperty
domain: Resource Offer
range: Agent
comment: A Resource Offer is solicited by an [Agent](../entities/Agent.md).

offers
type: ObjectProperty
domain: Resource Offer
range: Resource
comment: A Resource Offer specifies the [Resource](../entities/Resource.md) that is the subject of the offer.

hasAddressee
type: ObjectProperty
domain: Resource Request
range: Agent
comment: A Resource Request always references its addressee, the [Agent](../entities/Agent.md) that is expected to consider the resource request. (Note the role can be called differently in specific contexts.)

hasDecision
type: ObjectProperty
domain: Resource Request
range: Decision
comment: A Resource Request can have a [Decision](../entities/Decision.md) about accepting or refusing request made by addressee.

hasEvaluationOutcome
type: ObjectProperty
domain: Resource Request
range: Decision
comment: A Resource Request can have some kind of process which results in an [Evaluation Outcome](../entities/Evaluation_Outcome.md).

hasRequester
type: ObjectProperty
domain: Resource Request
range: Agent
comment: A Resource Request always has the requester: the [Agent](../entities/Agent.md) that is requesting a resource. (Note that the role can be called differently in specific contexts, for instance applicant.)

isDescribedBy
type: ObjectProperty
domain: Resource Request
range: Document
comment: A Resource Request can optionally reference its contents, the [Document](../entities/Document.md) that details the resource request.

requests
type: ObjectProperty
domain: Resource Request
range: Resource
comment: A Resource Request specifies the [Resource](../entities/Resource.md) that is the subject of the request.

revises
type: ObjectProperty
domain: Resource Request
range: Resource Request
comment: A Resource Request can revise the another [Resource Request](../entities/Document.md) that wasn't successful in the previous round.

details
type: ObjectProperty
domain: Resource Usage Statement
range: Contribution Statement
comment: A Resource Usage Statement can detail any number of [Contribution Statements](../entities/Contribution_Statement.md).

uses
type: ObjectProperty
domain: Resource Usage Statement
range: Resource
comment: A Resource Usage Statement specifies the [Resource](../entities/Resource.md) that is being used.

the location of the resource
type: DatatypeProperty
domain: Accessible on the Web
range: URI

the raw form of the affiliation as found e.g. in scholarly publications; more structured statements make use of the *institution* and/or *organisation unit* relationships below
type: DatatypeProperty
domain: Affiliation Statement
range: Multilingual String

the raw form of the name of the person as found e.g. in scholarly publications; more structured statements make use of the *person* relationship below
type: DatatypeProperty
domain: Affiliation Statement
range: Multilingual String

until when applications can be submitted
type: DatatypeProperty
domain: Call for Applications
range: Date

contributionSortingKey
type: DatatypeProperty
domain: Contribution
range: Decimal
label: An optional numeric sorting key: for one linked object it establishes the sequence of contributions of a specific kind. This is to be used where the order is conventionally important, such as authors or editors of a Document.

this should be the preferred way of referencing a country
type: DatatypeProperty
domain: Country
range: ISO 3166 Alpha2 Code

the location from which the resource can be downloaded
type: DatatypeProperty
domain: Downloadable
range: URI

the format of the resource
type: DatatypeProperty
domain: Downloadable
range: String

the size of the resource (if known)
type: DatatypeProperty
domain: Downloadable
range: Decimal

mandatory
type: DatatypeProperty
domain: Monetary Amount
range: Decimal

mandatory
type: DatatypeProperty
domain: Monetary Amount
range: ISO 4217 Alpha Code

Accessible on the Web
type: Class
comment: Anything that can be accessed on the World Wide Web.

Acknowledgement Statement
type: Class
comment: Anything that testifies, demonstrates or acknowledges a [Contribution](../entities/Contribution.md).

Activity
type: Class
comment: Anything an Agent does.

Affiliation Statement
type: Class
comment: A statement of a connection between a [Person](../entities/Person.md) and an [Organisation Unit](../entities/Organisation_Unit.md).

Agent
type: Class
comment: Anything that has the ability to perform activities.

Agent Identifier
type: Class
comment: An identifier that is assigned to an [Agent](../entities/Agent.md).

Application
type: Class
subclass of: Resource Request
comment: A formal request to be considered for a position or to be allowed to do or have something, submitted to an authority, institution, or organization.[1](#fn1)

Application Review
type: Class
subclass of: Contribution to Evaluation Outcome
comment: Any contribution to an [Evaluation Outcome](../entities/Evaluation_Outcome.md) of an [Application](../entities/Application.md) an [Agent](../entities/Agent.md) made by reviewing the Application.

Audio Contents
type: Class
comment: A resource primarily intended to be heard.[1](#fn1)

Call for Applications
type: Class
subclass of: Resource Offer
comment: A written or verbal request inviting someone to go somewhere or to do something,[1](#fn1) namely, submit an [Application](../entities/Application.md).

Call for Funding Applications
type: Class
subclass of: Call for Applications
comment: A [Call for Applications](../entities/Call_for_Applications.md) that expects [Funding Applications](../entities/Funding_Application.md).

Condition
type: Class
comment: A condition that needs to be satisfied for a Resource Offer to be applicable.[1](#fn1)

Contents Location
type: Class
comment: Location of contents of a [Document](../entities/Document.md).

Contribution
type: Class
subclass of: Activity
comment: An activity that helps achieve a goal.

Contribution Statement
type: Class
comment: An element of a [Contribution](../entities/Contribution.md). All such elements taken together describe the Contribution.

Contribution to Document
type: Class
comment: Any contribution an [Agent](../entities/Agent.md) made to a [Document](../entities/Document.md).

Contribution to Evaluation Outcome
type: Class
comment: Any contribution an [Agent](../entities/Agent.md) made to an [Evaluation Outcome](../entities/Evaluation_Outcome.md).

Contribution to Event
type: Class
subclass of: Contribution
comment: Any contribution an [Agent](../entities/Agent.md) made to an [Event](../entities/Event.md).

Contribution to Infrastructure
type: Class
subclass of: Contribution
comment: Any contribution an [Agent](../entities/Agent.md) made to an [Infrastructure](../entities/Infrastructure.md).

Contribution to Prize
type: Class
subclass of: Contribution
comment: Any contribution an [Agent](../entities/Agent.md) made to a [Prize](../entities/Prize.md).

Contribution to Prize Award
type: Class
subclass of: Contribution
comment: Any contribution an [Agent](../entities/Agent.md) made to a [Prize Award](../entities/Prize_Award.md).

Contribution to Project
type: Class
comment: Any contribution an [Agent](../entities/Agent.md) made to a [Project](../entities/Resource.md).

Country
type: Class
comment: An area of land that has or used to have its own government and laws.[1](#fn1)

DOI Identifier
type: Class
subclass of: Resource Identifier
comment: A DOI[1](#fn1) identifier assigned to a [Document](../entities/Document.md).

Date Range
type: Class
comment: A range of [Dates](../datatypes/Date.md).

Decision
type: Class
comment: The conclusions from considering a [Resource Request](../entities/Resource_Request.md).

Document
type: Class
subclass of: Resource
comment: A document is a bounded representation of a body of information designed with the capacity (and usually intent) to communicate. A document may manifest symbolic, diagrammatic or sensory-representational information.[1](#fn1)

Document Publication
type: Class
comment: The act of making information or stories available to people in a printed or electronic form.[1](#fn1)

Downloadable
type: Class
comment: Anything that can be downloaded from the World Wide Web.

Education
type: Class
subclass of: Involvement
comment: The process of (teaching or) learning, especially in a school or college, or the knowledge that you get from this.[1](#fn1)

Electronic Address
type: Class
subclass of: Contact Information
comment: An electronic address assigned to an [Agent](../entities/Organisation_Unit.md).

Employment
type: Class
subclass of: Involvement
comment: Work that you are paid to do for a particular company or organization.[1](#fn1)

Decision
type: Class
comment: The conclusions of an evaluation process.

Event
type: Class
comment: A thing that happens, especially something important.[1](#fn1)

Event Identifier
type: Class
comment: An identifier that is assigned to an [Event](../entities/Event.md).

Event_Series
type: Class
comment: A thing that happens regularly (annually, bi-annually, etc.) about a particular subject.

Expertise And Skills
type: Class
comment: **Expertise**: A high level of knowledge or skill.[1](#fn1) **Skill**: An ability to do an activity or job well, especially because you have practised it.[2](#fn2)

Expertise and Skills Condition
type: Class
subclass of: Condition
comment: The scope of the entity and its meaning.[1](#fn1)

Expertise and Skills Possession
type: Class
comment: The statement of Possession of an [Expertise or Skill](../entities/Expertise_and_Skills.md) by an [Agent](../entities/Agent.md).

Expertise and Time and Effort
type: Class
subclass of: Resource
comment: **Expertise**: A high level of knowledge or skill.[1](#fn1) **Time**: An amount of time that you have available to do something.[2](#fn2) **Effort**: Physical or mental activity needed to achieve something.[3](#fn3)

FundRef Identifier
type: Class
subclass of: Agent Identifier
comment: A FundRef[1](#fn1) identifier assigned to an [Organisation unit](../entities/Organisation_Unit.md).

Funding
type: Class
subclass of: Resource
comment: Money provided by an organization or government for a particular purpose.[1](#fn1)

Funding Application
type: Class
subclass of: Application
comment: An application submitted in the form and manner described by a Funding agency, the purpose of which is to provide information to a Commission for project selection.[1](#fn1)

Group
type: Class
subclass of: Group or Organisation Unit
comment: A non-formal group of [Agents](../entities/Agent.md).

Group or Organisation Unit
type: Class
subclass of: Agent
comment: A common supertype for [Group](../entities/Group.md) and [Organisation Unit](../entities/Organisation_Unit.md).

ISNI Identifier
type: Class
subclass of: Agent Identifier
comment: An ISNI[1](#fn1) identifier assigned to an [Agent](../entities/Agent.md).

Infrastructure
type: Class
subclass of: Resource
comment: The basic structure of an organization or system which is necessary for its operation, esp. public water, energy, and systems for communication and transport.[1](#fn1)

Involvement
type: Class
subclass of: Activity
comment: The act or process of taking part in something,[1](#fn1) namely in a [Group or Organisation Unit](../entities/Group_or_Organisation_Unit.md).

Language
type: Class
comment: A system of communication used by people living in a particular country consisting of sounds, words, and grammar.[1](#fn1)

Local Agent Identifier
type: Class
subclass of: Agent Identifier
comment: A local identifier assigned to an [Agent](../entities/Agent.md). Local identifier is not adopted at global level, it might be some platform identifier, regional identifier or national identifier.

Local Resource Identifier
type: Class
subclass of: Resource Identifier
comment: A local identifier assigned to a [Resource](../entities/Resource.md). Local identifier is not adopted at global level, it might be some platform identifier, regional identifier or national identifier.

Membership
type: Class
subclass of: Involvement
comment: The [Involvement](../entities/Involvement.md) of being a member in a [Group](../entities/Group.md).

Monetary Amount
type: Class
comment: A certain volume of money, together with the specification of a currency.

ORCID Identifier
type: Class
subclass of: Agent Identifier
comment: An ORCID[1](#fn1) identifier assigned to a [Person](../entities/Person.md).

Organisation Unit
type: Class
subclass of: Group or Organisation Unit
comment: An Organisation or a part of an Organisation's structure. **Organisation**: A formal, goal-orientated group with members and a defined structure, governed by rules and procedures that guide operation.[1](#fn1)

Page Based Contents Location
type: Class
subclass of: Contents Location
comment: A [Contents Location](../datatypes/Contents_Location.md) that is based on a range of pages.

Person
type: Class
subclass of: Agent
comment: A human being as an individual.[1](#fn1)

Person Name
type: Class
comment: The name of a [Person](../entities/Person.md).

Physical Address
type: Class
comment: The location assigned to an [Organisation Unit](../entities/Organisation_Unit.md) or some other CERIF entity instance.

Position
type: Class
comment: A rank or level in a company, competition, or society.[1](#fn1)

Postal Address
type: Class
subclass of: Contact Information
comment: A postal address assigned to an [Agent](../entities/Organisation_Unit.md).

Prize
type: Class
comment: Something valuable, such as an amount of money, that is given to someone who succeeds in a competition or game or that is given to someone as a reward for doing very good work.[1](#fn1)

Prize Award
type: Class
comment: A [prize](../entities/Prize.md) or a sum of money that a person or organization is given for an achievement.[1](#fn1)

Project
type: Class
comment: A temporary endeavor undertaken to create a unique product, service or result. Source: the Project Management Institute, https://www.pmi.org/about/learn-about-pmi/what-is-project-management

Publication Channel
type: Class
comment: A Publication Channel is a medium for publishing documents.

ROR Identifier
type: Class
subclass of: Agent Identifier
comment: A ROR[1](#fn1) identifier assigned to an [Organisation unit](../entities/Organisation_Unit.md).

Repository
type: Class
subclass of: Infrastructure
subclass of: Publication Channel
comment: A place where things are stored and can be found.[1](#fn1)

Resource
type: Class
comment: Anything that can be used for or in the process of research.

Resource Identifier
type: Class
comment: An identifier that is assigned to a [Resource](../entities/Resource.md).

Resource Offer
type: Class
comment: An offer of a [Resource](../entities/Resource.md) for usage.

Resource Request
type: Class
comment: A request to use a [Resource](../entities/Resource.md).

Resource Usage Statement
type: Class
comment: An element of a [Contribution](../entities/Contribution.md). All such elements taken together describe the Contribution.

Script
type: Class
comment: Script indicates writing system variations that distinguish the written forms of a language or its dialects[1](#fn1)

Simple Postal Address
type: Class
subclass of: Physical Address
comment: This data type is used when a string representation of physical address is used.

Structured Postal Address
type: Class
subclass of: Physical Address
comment: This data type is used when a structured representation of physical address is used.

Tangible
type: Class
comment: Something that is real and able to be shown or touched.[1](#fn1)

Textual Contents
type: Class
comment: A resource consisting primarily of words for reading.[1](#fn1)

Time Based Contents Location
type: Class
subclass of: Contents Location
comment: A [Contents Location](../datatypes/Contents_Location.md) that is based on a time interval.

Video Contents
type: Class
comment: Media that makes use of images (usually "moving"), with or without sound, over a period of playback time.[1](#fn1)

Visiting Address
type: Class
subclass of: Contact Information
comment: A visiting address assigned to an [Agent](../entities/Organisation_Unit.md).

Wikidata Agent Identifier
type: Class
subclass of: Agent Identifier
comment: A Wikidata[1](#fn1) identifier assigned to an [Agent](../entities/Agent.md).

Wikidata Resource Identifier
type: Class
subclass of: Resource Identifier
comment: A Wikidata[1](#fn1) identifier assigned to a [Resource](../entities/Resource.md).